﻿Age Bracket,Age Group,Dose Form,Dose Unit,Drug Reactions,Drugname,Trial Start Dt,City,State,Patient Gender,Patient Outcome,Prod Ai,Outcome Detail,Reaction Term,Age,Number of Records,Primaryid,Weight
35 to 44 Yrs,ADULT,,MG,INTEGUMENTARY,ACTEMRA,11/2/2018,Memphis,Tennessee,Female,Other Serious,TOCILIZUMAB,Skin exfoliation,Skin exfoliation,42,1,120844121,318
35 to 44 Yrs,ADULT,,MG,No Severe Reaction,ACTEMRA,11/2/2018,Memphis,Tennessee,Female,Other Serious,TOCILIZUMAB,Erythema,Erythema,42,1,120844121,318
55 to 64 Yrs,ADULT,,MG,INTEGUMENTARY,ACTEMRA,11/30/2018,Memphis,Tennessee,Female,Positive Result,TOCILIZUMAB,Skin lesion,Skin lesion,59,1,119133291,
55 to 64 Yrs,ADULT,,MG,INTEGUMENTARY,ACTEMRA,2/25/2019,Memphis,Tennessee,Female,Other Serious,TOCILIZUMAB,Skin disorder,Skin disorder,60,1,122177361,
55 to 64 Yrs,ADULT,,MG,No Severe Reaction,ACTEMRA,2/25/2019,Memphis,Tennessee,Female,Other Serious,TOCILIZUMAB,Contusion,Contusion,60,1,122177361,
55 to 64 Yrs,ADULT,,MG,No Severe Reaction,ACTEMRA,2/25/2019,Memphis,Tennessee,Female,Other Serious,TOCILIZUMAB,Pruritus,Pruritus,60,1,122177361,
65 Yrs & Over,ELDERLY,SUSPENSION FOR INJECTION,DF,No Severe Reaction,ACTEMRA,2/11/2019,Memphis,Tennessee,Female,Other Serious,TOCILIZUMAB,Contusion,Contusion,75,1,120843141,
65 Yrs & Over,ELDERLY,SUSPENSION FOR INJECTION,DF,No Severe Reaction,ACTEMRA,2/11/2019,Memphis,Tennessee,Female,Other Serious,TOCILIZUMAB,Pyrexia,Pyrexia,75,1,120843141,
65 Yrs & Over,ELDERLY,SUSPENSION FOR INJECTION,DF,THROAT,ACTEMRA,2/11/2019,Memphis,Tennessee,Female,Other Serious,TOCILIZUMAB,Neck pain,Neck pain,75,1,120843141,
65 Yrs & Over,ELDERLY,SUSPENSION FOR INJECTION,DF,No Severe Reaction,ACTEMRA,2/11/2019,Memphis,Tennessee,Female,Other Serious,TOCILIZUMAB,Contusion,Contusion,75,1,120843141,
65 Yrs & Over,ELDERLY,SUSPENSION FOR INJECTION,DF,No Severe Reaction,ACTEMRA,2/11/2019,Memphis,Tennessee,Female,Other Serious,TOCILIZUMAB,Pyrexia,Pyrexia,75,1,120843141,
65 Yrs & Over,ELDERLY,SUSPENSION FOR INJECTION,DF,THROAT,ACTEMRA,2/11/2019,Memphis,Tennessee,Female,Other Serious,TOCILIZUMAB,Neck pain,Neck pain,75,1,120843141,
65 Yrs & Over,ELDERLY,SOLUTION FOR INJECTION IN PRE-FILLED SYRINGE,MG,BLOOD,ACTEMRA,12/25/2018,Reno,Nevada,Female,Other Serious,TOCILIZUMAB,Blood beta-D-glucan increased,Blood beta-D-glucan increased,70.697,1,121860611,52
65 Yrs & Over,ELDERLY,SOLUTION FOR INJECTION IN PRE-FILLED SYRINGE,MG,CHEST,ACTEMRA,12/25/2018,Reno,Nevada,Female,Other Serious,TOCILIZUMAB,Lung disorder,Lung disorder,70.697,1,121860611,52
65 Yrs & Over,ELDERLY,SOLUTION FOR INFUSION,MG,No Severe Reaction,ACTEMRA,2/19/2018,Atlanta,Georgia,Female,Other Serious,TOCILIZUMAB,Influenza,Influenza,78.634,1,120099651,107
65 Yrs & Over,ELDERLY,SOLUTION FOR INFUSION,MG,No Severe Reaction,ACTEMRA,2/19/2018,Atlanta,Georgia,Female,Other Serious,TOCILIZUMAB,Malaise,Malaise,78.634,1,120099651,107
65 Yrs & Over,ELDERLY,SOLUTION FOR INJECTION IN PRE-FILLED SYRINGE,MG,No Severe Reaction,ACTEMRA,12/25/2018,Reno,Nevada,Female,Other Serious,TOCILIZUMAB,Dyspnoea,Dyspnoea,70.697,1,121860611,52
65 Yrs & Over,ELDERLY,SOLUTION FOR INJECTION IN PRE-FILLED SYRINGE,MG,No Severe Reaction,ACTEMRA,12/25/2018,Reno,Nevada,Female,Other Serious,TOCILIZUMAB,Pyrexia,Pyrexia,70.697,1,121860611,52
65 Yrs & Over,ELDERLY,SOLUTION FOR INJECTION IN PRE-FILLED SYRINGE,MG,THROAT,ACTEMRA,12/25/2018,Reno,Nevada,Female,Other Serious,TOCILIZUMAB,Cough,Cough,70.697,1,121860611,52
55 to 64 Yrs,ADULT,,,CHEST,ACTEMRA,2/8/2019,Atlanta,Georgia,Female,Other Serious,TOCILIZUMAB,Chest discomfort,Chest discomfort,56.641,1,121033671,118
55 to 64 Yrs,ADULT,,,GASTRO,ACTEMRA,2/8/2019,Atlanta,Georgia,Female,Other Serious,TOCILIZUMAB,Stomatitis,Stomatitis,56.641,1,121033671,118
55 to 64 Yrs,ADULT,,,No Severe Reaction,ACTEMRA,2/8/2019,Atlanta,Georgia,Female,Other Serious,TOCILIZUMAB,Pharyngeal erythema,Pharyngeal erythema,56.641,1,121033671,118
55 to 64 Yrs,ADULT,,,No Severe Reaction,ACTEMRA,2/8/2019,Atlanta,Georgia,Female,Other Serious,TOCILIZUMAB,Pharyngeal oedema,Pharyngeal oedema,56.641,1,121033671,118
55 to 64 Yrs,ADULT,,,No Severe Reaction,ACTEMRA,2/8/2019,Atlanta,Georgia,Female,Other Serious,TOCILIZUMAB,Sinusitis,Sinusitis,56.641,1,121033671,118
55 to 64 Yrs,ADULT,,,THROAT,ACTEMRA,2/8/2019,Atlanta,Georgia,Female,Other Serious,TOCILIZUMAB,Cough,Cough,56.641,1,121033671,118
45 to 54 Yrs,ADULT,SOLUTION FOR INFUSION,MG,HEAD,ACTEMRA,11/17/2018,Boston,Massachusetts,Female,Other Serious,TOCILIZUMAB,Anxiety,Anxiety,48.676,1,119235441,
45 to 54 Yrs,ADULT,SOLUTION FOR INFUSION,MG,HEAD,ACTEMRA,11/17/2018,Boston,Massachusetts,Female,Other Serious,TOCILIZUMAB,Depression,Depression,48.676,1,119235441,
45 to 54 Yrs,ADULT,SOLUTION FOR INFUSION,MG,No Severe Reaction,ACTEMRA,11/17/2018,Boston,Massachusetts,Female,Other Serious,TOCILIZUMAB,Catheter site haemorrhage,Catheter site haemorrhage,48.676,1,119235441,
45 to 54 Yrs,ADULT,SOLUTION FOR INFUSION,MG,No Severe Reaction,ACTEMRA,11/17/2018,Boston,Massachusetts,Female,Other Serious,TOCILIZUMAB,Menorrhagia,Menorrhagia,48.676,1,119235441,
55 to 64 Yrs,ADULT,,MG,No Severe Reaction,ACTEMRA,2/22/2019,Memphis,Tennessee,Female,Other Serious,TOCILIZUMAB,Musculoskeletal pain,Musculoskeletal pain,62,1,121103611,140
55 to 64 Yrs,ADULT,,MG,No Severe Reaction,ACTEMRA,2/22/2019,Memphis,Tennessee,Female,Other Serious,TOCILIZUMAB,Pain in extremity,Pain in extremity,62,1,121103611,140
55 to 64 Yrs,ADULT,,MG,THROAT,ACTEMRA,2/22/2019,Memphis,Tennessee,Female,Other Serious,TOCILIZUMAB,Neck pain,Neck pain,62,1,121103611,140
65 Yrs & Over,ELDERLY,,MG,GASTRO,ACTEMRA,1/7/2019,Reno,Nevada,Female,Disability,TOCILIZUMAB,Large intestine perforation,Large intestine perforation,72.767,1,121741761,40
65 Yrs & Over,ELDERLY,,MG,GASTRO,ACTEMRA,1/7/2019,Reno,Nevada,Female,Hospitalization,TOCILIZUMAB,Large intestine perforation,Large intestine perforation,72.767,1,121741761,40
45 to 54 Yrs,ADULT,SOLUTION FOR INFUSION,MG,CHEST,ACTEMRA,1/13/2019,Boston,Massachusetts,Female,Hospitalization,TOCILIZUMAB,Cardiac disorder,Cardiac disorder,52.164,1,121667321,
45 to 54 Yrs,ADULT,SOLUTION FOR INFUSION,MG,HEAD,ACTEMRA,1/13/2019,Boston,Massachusetts,Female,Hospitalization,TOCILIZUMAB,Drug ineffective,Drug ineffective,52.164,1,121667321,
45 to 54 Yrs,ADULT,SOLUTION FOR INFUSION,MG,No Severe Reaction,ACTEMRA,1/13/2019,Boston,Massachusetts,Female,Hospitalization,TOCILIZUMAB,Myocarditis,Myocarditis,52.164,1,121667321,
65 Yrs & Over,ELDERLY,SOLUTION FOR INFUSION,,CHEST,ACTEMRA,2/27/2019,Boston,Massachusetts,Female,Hospitalization,TOCILIZUMAB,Cardiac failure,Cardiac failure,91.302,1,121541381,
65 Yrs & Over,ELDERLY,SOLUTION FOR INFUSION,,No Severe Reaction,ACTEMRA,2/27/2019,Boston,Massachusetts,Female,Hospitalization,TOCILIZUMAB,Asthenia,Asthenia,91.302,1,121541381,
65 Yrs & Over,ELDERLY,SOLUTION FOR INFUSION,,No Severe Reaction,ACTEMRA,2/27/2019,Boston,Massachusetts,Female,Hospitalization,TOCILIZUMAB,Circulatory collapse,Circulatory collapse,91.302,1,121541381,
65 Yrs & Over,ELDERLY,SOLUTION FOR INFUSION,,No Severe Reaction,ACTEMRA,2/27/2019,Boston,Massachusetts,Female,Hospitalization,TOCILIZUMAB,Dehydration,Dehydration,91.302,1,121541381,
55 to 64 Yrs,ADULT,SOLUTION FOR INFUSION,MG,BLOOD,ACTEMRA,11/27/2018,Reno,Nevada,Male,Death,TOCILIZUMAB,Blood albumin decreased,Blood albumin decreased,62.42,1,121761021,
55 to 64 Yrs,ADULT,SOLUTION FOR INFUSION,MG,BLOOD,ACTEMRA,11/27/2018,Reno,Nevada,Male,Death,TOCILIZUMAB,Blood potassium increased,Blood potassium increased,62.42,1,121761021,
55 to 64 Yrs,ADULT,SOLUTION FOR INFUSION,MG,KIDNEY,ACTEMRA,11/27/2018,Reno,Nevada,Male,Death,TOCILIZUMAB,Renal vessel disorder,Renal vessel disorder,62.42,1,121761021,
55 to 64 Yrs,ADULT,SOLUTION FOR INFUSION,MG,LIVER,ACTEMRA,11/27/2018,Reno,Nevada,Male,Death,TOCILIZUMAB,Hepatic function abnormal,Hepatic function abnormal,62.42,1,121761021,
55 to 64 Yrs,ADULT,SOLUTION FOR INFUSION,MG,No Severe Reaction,ACTEMRA,11/27/2018,Reno,Nevada,Male,Death,TOCILIZUMAB,Epstein-Barr virus associated lymphoproliferative disorder,Epstein-Barr virus associated lymphoproliferative disorder,62.42,1,121761021,
55 to 64 Yrs,ADULT,SOLUTION FOR INFUSION,MG,No Severe Reaction,ACTEMRA,11/27/2018,Reno,Nevada,Male,Death,TOCILIZUMAB,Epstein-Barr virus infection,Epstein-Barr virus infection,62.42,1,121761021,
55 to 64 Yrs,ADULT,SOLUTION FOR INFUSION,MG,No Severe Reaction,ACTEMRA,11/27/2018,Reno,Nevada,Male,Death,TOCILIZUMAB,Hyponatraemia,Hyponatraemia,62.42,1,121761021,
55 to 64 Yrs,ADULT,SOLUTION FOR INFUSION,MG,BLOOD,ACTEMRA,11/27/2018,Reno,Nevada,Male,Other Serious,TOCILIZUMAB,Blood albumin decreased,Blood albumin decreased,62.42,1,121761021,
55 to 64 Yrs,ADULT,SOLUTION FOR INFUSION,MG,BLOOD,ACTEMRA,11/27/2018,Reno,Nevada,Male,Other Serious,TOCILIZUMAB,Blood potassium increased,Blood potassium increased,62.42,1,121761021,
55 to 64 Yrs,ADULT,SOLUTION FOR INFUSION,MG,KIDNEY,ACTEMRA,11/27/2018,Reno,Nevada,Male,Other Serious,TOCILIZUMAB,Renal vessel disorder,Renal vessel disorder,62.42,1,121761021,
55 to 64 Yrs,ADULT,SOLUTION FOR INFUSION,MG,LIVER,ACTEMRA,11/27/2018,Reno,Nevada,Male,Other Serious,TOCILIZUMAB,Hepatic function abnormal,Hepatic function abnormal,62.42,1,121761021,
55 to 64 Yrs,ADULT,SOLUTION FOR INFUSION,MG,No Severe Reaction,ACTEMRA,11/27/2018,Reno,Nevada,Male,Other Serious,TOCILIZUMAB,Epstein-Barr virus associated lymphoproliferative disorder,Epstein-Barr virus associated lymphoproliferative disorder,62.42,1,121761021,
55 to 64 Yrs,ADULT,SOLUTION FOR INFUSION,MG,No Severe Reaction,ACTEMRA,11/27/2018,Reno,Nevada,Male,Other Serious,TOCILIZUMAB,Epstein-Barr virus infection,Epstein-Barr virus infection,62.42,1,121761021,
55 to 64 Yrs,ADULT,SOLUTION FOR INFUSION,MG,No Severe Reaction,ACTEMRA,11/27/2018,Reno,Nevada,Male,Other Serious,TOCILIZUMAB,Hyponatraemia,Hyponatraemia,62.42,1,121761021,
45 to 54 Yrs,ADULT,SUSPENSION FOR INJECTION,DF,HEAD,ACTEMRA,3/21/2019,Memphis,Tennessee,Male,Other Serious,TOCILIZUMAB,Anxiety,Anxiety,48,1,122069781,
45 to 54 Yrs,ADULT,SUSPENSION FOR INJECTION,DF,HEAD,ACTEMRA,3/21/2019,Memphis,Tennessee,Male,Other Serious,TOCILIZUMAB,Feeling abnormal,Feeling abnormal,48,1,122069781,
45 to 54 Yrs,ADULT,SUSPENSION FOR INJECTION,DF,INTEGUMENTARY,ACTEMRA,3/21/2019,Memphis,Tennessee,Male,Other Serious,TOCILIZUMAB,Burning sensation,Burning sensation,48,1,122069781,
45 to 54 Yrs,ADULT,SUSPENSION FOR INJECTION,DF,No Severe Reaction,ACTEMRA,3/21/2019,Memphis,Tennessee,Male,Other Serious,TOCILIZUMAB,Cognitive disorder,Cognitive disorder,48,1,122069781,
45 to 54 Yrs,ADULT,SUSPENSION FOR INJECTION,DF,No Severe Reaction,ACTEMRA,3/21/2019,Memphis,Tennessee,Male,Other Serious,TOCILIZUMAB,Condition aggravated,Condition aggravated,48,1,122069781,
45 to 54 Yrs,ADULT,SUSPENSION FOR INJECTION,DF,No Severe Reaction,ACTEMRA,3/21/2019,Memphis,Tennessee,Male,Other Serious,TOCILIZUMAB,Inflammation,Inflammation,48,1,122069781,
45 to 54 Yrs,ADULT,SUSPENSION FOR INJECTION,DF,No Severe Reaction,ACTEMRA,3/21/2019,Memphis,Tennessee,Male,Other Serious,TOCILIZUMAB,Paraesthesia,Paraesthesia,48,1,122069781,
55 to 64 Yrs,ADULT,,MG,BLOOD,ACTEMRA,5/27/2019,Tucson,Arizona,Male,Other Serious,TOCILIZUMAB,Blood cholesterol increased,Blood cholesterol increased,56.096,1,117762292,125
55 to 64 Yrs,ADULT,,MG,BLOOD,ACTEMRA,5/27/2019,Tucson,Arizona,Male,Other Serious,TOCILIZUMAB,White blood cell count increased,White blood cell count increased,56.096,1,117762292,125
55 to 64 Yrs,ADULT,,MG,CHEST,ACTEMRA,5/27/2019,Tucson,Arizona,Male,Other Serious,TOCILIZUMAB,Blood pressure increased,Blood pressure increased,56.096,1,117762292,125
55 to 64 Yrs,ADULT,,MG,CHEST,ACTEMRA,5/27/2019,Tucson,Arizona,Male,Other Serious,TOCILIZUMAB,Blood pressure systolic increased,Blood pressure systolic increased,56.096,1,117762292,125
55 to 64 Yrs,ADULT,,MG,GENITOURINARY,ACTEMRA,5/27/2019,Tucson,Arizona,Male,Other Serious,TOCILIZUMAB,Herpes zoster,Herpes zoster,56.096,1,117762292,125
55 to 64 Yrs,ADULT,,MG,No Severe Reaction,ACTEMRA,5/27/2019,Tucson,Arizona,Male,Other Serious,TOCILIZUMAB,Dysphonia,Dysphonia,56.096,1,117762292,125
55 to 64 Yrs,ADULT,,MG,No Severe Reaction,ACTEMRA,5/27/2019,Tucson,Arizona,Male,Other Serious,TOCILIZUMAB,Nasopharyngitis,Nasopharyngitis,56.096,1,117762292,125
55 to 64 Yrs,ADULT,,MG,No Severe Reaction,ACTEMRA,5/27/2019,Tucson,Arizona,Male,Other Serious,TOCILIZUMAB,Pain,Pain,56.096,1,117762292,125
55 to 64 Yrs,ADULT,,MG,THROAT,ACTEMRA,5/27/2019,Tucson,Arizona,Male,Other Serious,TOCILIZUMAB,Productive cough,Productive cough,56.096,1,117762292,125
65 Yrs & Over,ELDERLY,,,WRIST,ACTEMRA,4/24/2018,Cleveland,Ohio,Female,Other Serious,TOCILIZUMAB,Osteoarthritis,Osteoarthritis,68.931,1,120578591,49
65 Yrs & Over,ELDERLY,,,GASTRO,ACTEMRA,4/24/2018,Cleveland,Ohio,Female,Other Serious,TOCILIZUMAB,Diarrhoea,Diarrhoea,68.931,1,120578591,49
65 Yrs & Over,ELDERLY,,,INTEGUMENTARY,ACTEMRA,4/24/2018,Cleveland,Ohio,Female,Other Serious,TOCILIZUMAB,Eye swelling,Eye swelling,68.931,1,120578591,49
65 Yrs & Over,ELDERLY,,,INTEGUMENTARY,ACTEMRA,4/24/2018,Cleveland,Ohio,Female,Other Serious,TOCILIZUMAB,Peripheral swelling,Peripheral swelling,68.931,1,120578591,49
65 Yrs & Over,ELDERLY,,,INTEGUMENTARY,ACTEMRA,4/24/2018,Cleveland,Ohio,Female,Other Serious,TOCILIZUMAB,Swelling face,Swelling face,68.931,1,120578591,49
65 Yrs & Over,ELDERLY,,,SKELETAL,ACTEMRA,4/24/2018,Cleveland,Ohio,Female,Other Serious,TOCILIZUMAB,Bone disorder,Bone disorder,68.931,1,120578591,49
65 Yrs & Over,ELDERLY,,,SKELETAL,ACTEMRA,4/24/2018,Cleveland,Ohio,Female,Other Serious,TOCILIZUMAB,Joint range of motion decreased,Joint range of motion decreased,68.931,1,120578591,49
65 Yrs & Over,ELDERLY,,,SKELETAL,ACTEMRA,4/24/2018,Cleveland,Ohio,Female,Other Serious,TOCILIZUMAB,Osteopenia,Osteopenia,68.931,1,120578591,49
65 Yrs & Over,ELDERLY,,,No Severe Reaction,ACTEMRA,4/24/2018,Cleveland,Ohio,Female,Other Serious,TOCILIZUMAB,Body height decreased,Body height decreased,68.931,1,120578591,49
65 Yrs & Over,ELDERLY,,,No Severe Reaction,ACTEMRA,4/24/2018,Cleveland,Ohio,Female,Other Serious,TOCILIZUMAB,Finger deformity,Finger deformity,68.931,1,120578591,49
65 Yrs & Over,ELDERLY,,,No Severe Reaction,ACTEMRA,4/24/2018,Cleveland,Ohio,Female,Other Serious,TOCILIZUMAB,Gait disturbance,Gait disturbance,68.931,1,120578591,49
65 Yrs & Over,ELDERLY,,,No Severe Reaction,ACTEMRA,4/24/2018,Cleveland,Ohio,Female,Other Serious,TOCILIZUMAB,Ill-defined disorder,Ill-defined disorder,68.931,1,120578591,49
65 Yrs & Over,ELDERLY,,,No Severe Reaction,ACTEMRA,4/24/2018,Cleveland,Ohio,Female,Other Serious,TOCILIZUMAB,Insomnia,Insomnia,68.931,1,120578591,49
65 Yrs & Over,ELDERLY,,,No Severe Reaction,ACTEMRA,4/24/2018,Cleveland,Ohio,Female,Other Serious,TOCILIZUMAB,Oropharyngeal pain,Oropharyngeal pain,68.931,1,120578591,49
65 Yrs & Over,ELDERLY,,,No Severe Reaction,ACTEMRA,4/24/2018,Cleveland,Ohio,Female,Other Serious,TOCILIZUMAB,Pain,Pain,68.931,1,120578591,49
65 Yrs & Over,ELDERLY,,,No Severe Reaction,ACTEMRA,4/24/2018,Cleveland,Ohio,Female,Other Serious,TOCILIZUMAB,Pharyngeal oedema,Pharyngeal oedema,68.931,1,120578591,49
65 Yrs & Over,ELDERLY,,,HEAD,ACTEMRA,4/24/2018,Cleveland,Ohio,Female,Other Serious,TOCILIZUMAB,Drug ineffective,Drug ineffective,68.931,1,120578591,49
65 Yrs & Over,ELDERLY,,,HEAD,ACTEMRA,4/24/2018,Cleveland,Ohio,Female,Other Serious,TOCILIZUMAB,Emotional disorder,Emotional disorder,68.931,1,120578591,49
65 Yrs & Over,ELDERLY,SOLUTION FOR INFUSION,MG,No Severe Reaction,ACTEMRA,11/26/2018,Tucson,Arizona,Female,Other Serious,TOCILIZUMAB,Off label use,Off label use,75.469,1,120921051,75
65 Yrs & Over,ELDERLY,SOLUTION FOR INFUSION,MG,No Severe Reaction,ACTEMRA,11/26/2018,Tucson,Arizona,Female,Other Serious,TOCILIZUMAB,Psoriasis,Psoriasis,75.469,1,120921051,75
45 to 54 Yrs,ADULT,SOLUTION FOR INJECTION IN PRE-FILLED SYRINGE,MG,SKELETAL,ACTEMRA,1/12/2019,Atlanta,Georgia,Female,Hospitalization,TOCILIZUMAB,Joint range of motion decreased,Joint range of motion decreased,51.6,1,119288341,51
45 to 54 Yrs,ADULT,SOLUTION FOR INJECTION IN PRE-FILLED SYRINGE,MG,HEAD,ACTEMRA,1/12/2019,Atlanta,Georgia,Female,Hospitalization,TOCILIZUMAB,Headache,Headache,51.6,1,119288341,51
65 Yrs & Over,ELDERLY,SOLUTION FOR INFUSION,,GASTRO,ACTEMRA,1/17/2019,Cleveland,Ohio,Female,Hospitalization,TOCILIZUMAB,Vomiting,Vomiting,65.049,1,122026531,94
65 Yrs & Over,ELDERLY,SOLUTION FOR INFUSION,,PANCREAS,ACTEMRA,1/17/2019,Cleveland,Ohio,Female,Hospitalization,TOCILIZUMAB,Blood glucose decreased,Blood glucose decreased,65.049,1,122026531,94
65 Yrs & Over,ELDERLY,SOLUTION FOR INFUSION,,No Severe Reaction,ACTEMRA,1/17/2019,Cleveland,Ohio,Female,Hospitalization,TOCILIZUMAB,Decreased appetite,Decreased appetite,65.049,1,122026531,94
65 Yrs & Over,ELDERLY,SOLUTION FOR INFUSION,,No Severe Reaction,ACTEMRA,1/17/2019,Cleveland,Ohio,Female,Hospitalization,TOCILIZUMAB,Dyspnoea,Dyspnoea,65.049,1,122026531,94
65 Yrs & Over,ELDERLY,SOLUTION FOR INFUSION,,No Severe Reaction,ACTEMRA,1/17/2019,Cleveland,Ohio,Female,Hospitalization,TOCILIZUMAB,Influenza,Influenza,65.049,1,122026531,94
65 Yrs & Over,ELDERLY,SOLUTION FOR INFUSION,,No Severe Reaction,ACTEMRA,1/17/2019,Cleveland,Ohio,Female,Hospitalization,TOCILIZUMAB,Pneumonia,Pneumonia,65.049,1,122026531,94
65 Yrs & Over,ELDERLY,SOLUTION FOR INFUSION,,GASTRO,ACTEMRA,1/17/2019,Cleveland,Ohio,Female,Other Serious,TOCILIZUMAB,Vomiting,Vomiting,65.049,1,122026531,94
65 Yrs & Over,ELDERLY,SOLUTION FOR INFUSION,,PANCREAS,ACTEMRA,1/17/2019,Cleveland,Ohio,Female,Other Serious,TOCILIZUMAB,Blood glucose decreased,Blood glucose decreased,65.049,1,122026531,94
65 Yrs & Over,ELDERLY,SOLUTION FOR INFUSION,,No Severe Reaction,ACTEMRA,1/17/2019,Cleveland,Ohio,Female,Other Serious,TOCILIZUMAB,Decreased appetite,Decreased appetite,65.049,1,122026531,94
65 Yrs & Over,ELDERLY,SOLUTION FOR INFUSION,,No Severe Reaction,ACTEMRA,1/17/2019,Cleveland,Ohio,Female,Other Serious,TOCILIZUMAB,Dyspnoea,Dyspnoea,65.049,1,122026531,94
65 Yrs & Over,ELDERLY,SOLUTION FOR INFUSION,,No Severe Reaction,ACTEMRA,1/17/2019,Cleveland,Ohio,Female,Other Serious,TOCILIZUMAB,Influenza,Influenza,65.049,1,122026531,94
65 Yrs & Over,ELDERLY,SOLUTION FOR INFUSION,,No Severe Reaction,ACTEMRA,1/17/2019,Cleveland,Ohio,Female,Other Serious,TOCILIZUMAB,Pneumonia,Pneumonia,65.049,1,122026531,94
55 to 64 Yrs,ADULT,SOLUTION FOR INFUSION,MG/KG,No Severe Reaction,ACTEMRA,12/14/2018,Atlanta,Georgia,Female,Hospitalization,TOCILIZUMAB,Colitis ischaemic,Colitis ischaemic,61,1,118911981,114
65 Yrs & Over,ELDERLY,SOLUTION FOR INJECTION IN PRE-FILLED SYRINGE,MG,BLOOD,ACTEMRA,12/25/2018,Reno,Nevada,Female,Hospitalization,TOCILIZUMAB,Blood beta-D-glucan increased,Blood beta-D-glucan increased,70.697,1,121860611,52
65 Yrs & Over,ELDERLY,SOLUTION FOR INJECTION IN PRE-FILLED SYRINGE,MG,CHEST,ACTEMRA,12/25/2018,Reno,Nevada,Female,Hospitalization,TOCILIZUMAB,Lung disorder,Lung disorder,70.697,1,121860611,52
65 Yrs & Over,ELDERLY,SOLUTION FOR INFUSION,MG,No Severe Reaction,ACTEMRA,2/19/2018,Atlanta,Georgia,Female,Hospitalization,TOCILIZUMAB,Influenza,Influenza,78.634,1,120099651,107
65 Yrs & Over,ELDERLY,SOLUTION FOR INFUSION,MG,No Severe Reaction,ACTEMRA,2/19/2018,Atlanta,Georgia,Female,Hospitalization,TOCILIZUMAB,Malaise,Malaise,78.634,1,120099651,107
65 Yrs & Over,ELDERLY,SOLUTION FOR INJECTION IN PRE-FILLED SYRINGE,MG,No Severe Reaction,ACTEMRA,12/25/2018,Reno,Nevada,Female,Hospitalization,TOCILIZUMAB,Dyspnoea,Dyspnoea,70.697,1,121860611,52
65 Yrs & Over,ELDERLY,SOLUTION FOR INJECTION IN PRE-FILLED SYRINGE,MG,No Severe Reaction,ACTEMRA,12/25/2018,Reno,Nevada,Female,Hospitalization,TOCILIZUMAB,Pyrexia,Pyrexia,70.697,1,121860611,52
65 Yrs & Over,ELDERLY,SOLUTION FOR INJECTION IN PRE-FILLED SYRINGE,MG,THROAT,ACTEMRA,12/25/2018,Reno,Nevada,Female,Hospitalization,TOCILIZUMAB,Cough,Cough,70.697,1,121860611,52
65 Yrs & Over,ELDERLY,SOLUTION FOR INFUSION,MG/KG,CHEST,ACTEMRA,6/16/2017,Boston,Massachusetts,Male,Hospitalization,TOCILIZUMAB,Bradycardia,Bradycardia,78.021,1,112332694,89
65 Yrs & Over,ELDERLY,SOLUTION FOR INFUSION,MG/KG,LIVER,ACTEMRA,6/16/2017,Boston,Massachusetts,Male,Hospitalization,TOCILIZUMAB,Gallbladder obstruction,Gallbladder obstruction,78.021,1,112332694,89
65 Yrs & Over,ELDERLY,SOLUTION FOR INFUSION,MG/KG,LIVER,ACTEMRA,6/16/2017,Boston,Massachusetts,Male,Hospitalization,TOCILIZUMAB,Hepatic steatosis,Hepatic steatosis,78.021,1,112332694,89
65 Yrs & Over,ELDERLY,SOLUTION FOR INFUSION,MG/KG,No Severe Reaction,ACTEMRA,6/16/2017,Boston,Massachusetts,Male,Hospitalization,TOCILIZUMAB,Cholecystitis,Cholecystitis,78.021,1,112332694,89
65 Yrs & Over,ELDERLY,SOLUTION FOR INFUSION,MG/KG,No Severe Reaction,ACTEMRA,6/16/2017,Boston,Massachusetts,Male,Hospitalization,TOCILIZUMAB,Diastolic dysfunction,Diastolic dysfunction,78.021,1,112332694,89
65 Yrs & Over,ELDERLY,SOLUTION FOR INFUSION,MG/KG,No Severe Reaction,ACTEMRA,6/16/2017,Boston,Massachusetts,Male,Hospitalization,TOCILIZUMAB,Enteritis infectious,Enteritis infectious,78.021,1,112332694,89
65 Yrs & Over,ELDERLY,SOLUTION FOR INFUSION,MG/KG,No Severe Reaction,ACTEMRA,6/16/2017,Boston,Massachusetts,Male,Hospitalization,TOCILIZUMAB,Leukopenia,Leukopenia,78.021,1,112332694,89
65 Yrs & Over,ELDERLY,SOLUTION FOR INFUSION,MG/KG,No Severe Reaction,ACTEMRA,6/16/2017,Boston,Massachusetts,Male,Hospitalization,TOCILIZUMAB,Neutropenia,Neutropenia,78.021,1,112332694,89
65 Yrs & Over,ELDERLY,SOLUTION FOR INFUSION,MG/KG,No Severe Reaction,ACTEMRA,6/16/2017,Boston,Massachusetts,Male,Hospitalization,TOCILIZUMAB,Platelet count decreased,Platelet count decreased,78.021,1,112332694,89
65 Yrs & Over,ELDERLY,SOLUTION FOR INFUSION,MG/KG,No Severe Reaction,ACTEMRA,6/16/2017,Boston,Massachusetts,Male,Hospitalization,TOCILIZUMAB,Sepsis,Sepsis,78.021,1,112332694,89
65 Yrs & Over,ELDERLY,SOLUTION FOR INFUSION,MG/KG,No Severe Reaction,ACTEMRA,6/16/2017,Boston,Massachusetts,Male,Hospitalization,TOCILIZUMAB,Splenomegaly,Splenomegaly,78.021,1,112332694,89
65 Yrs & Over,ELDERLY,SOLUTION FOR INFUSION,MG/KG,No Severe Reaction,ACTEMRA,6/16/2017,Boston,Massachusetts,Male,Hospitalization,TOCILIZUMAB,Thrombocytopenia,Thrombocytopenia,78.021,1,112332694,89
45 to 54 Yrs,ADULT,INFUSION,MG,CHEST,ACTEMRA,2/2/2017,Tucson,Arizona,Male,Other Serious,TOCILIZUMAB,Heart rate decreased,Heart rate decreased,45.752,1,998830210,70
45 to 54 Yrs,ADULT,INFUSION,MG,GASTRO,ACTEMRA,2/2/2017,Tucson,Arizona,Male,Other Serious,TOCILIZUMAB,Diarrhoea,Diarrhoea,45.752,1,998830210,70
45 to 54 Yrs,ADULT,INFUSION,MG,GASTRO,ACTEMRA,2/2/2017,Tucson,Arizona,Male,Other Serious,TOCILIZUMAB,Vomiting,Vomiting,45.752,1,998830210,70
45 to 54 Yrs,ADULT,INFUSION,MG,GASTRO,ACTEMRA,2/2/2017,Tucson,Arizona,Male,Other Serious,TOCILIZUMAB,Weight increased,Weight increased,45.752,1,998830210,70
45 to 54 Yrs,ADULT,INFUSION,MG,GENITOURINARY,ACTEMRA,2/2/2017,Tucson,Arizona,Male,Other Serious,TOCILIZUMAB,Oral herpes,Oral herpes,45.752,1,998830210,70
45 to 54 Yrs,ADULT,INFUSION,MG,HEAD,ACTEMRA,2/2/2017,Tucson,Arizona,Male,Other Serious,TOCILIZUMAB,Headache,Headache,45.752,1,998830210,70
45 to 54 Yrs,ADULT,INFUSION,MG,HEAD,ACTEMRA,2/2/2017,Tucson,Arizona,Male,Other Serious,TOCILIZUMAB,Nausea,Nausea,45.752,1,998830210,70
45 to 54 Yrs,ADULT,INFUSION,MG,INTEGUMENTARY,ACTEMRA,2/2/2017,Tucson,Arizona,Male,Other Serious,TOCILIZUMAB,Dry skin,Dry skin,45.752,1,998830210,70
45 to 54 Yrs,ADULT,INFUSION,MG,INTEGUMENTARY,ACTEMRA,2/2/2017,Tucson,Arizona,Male,Other Serious,TOCILIZUMAB,Rash,Rash,45.752,1,998830210,70
45 to 54 Yrs,ADULT,INFUSION,MG,KIDNEY,ACTEMRA,2/2/2017,Tucson,Arizona,Male,Other Serious,TOCILIZUMAB,Renal colic,Renal colic,45.752,1,998830210,70
45 to 54 Yrs,ADULT,INFUSION,MG,No Severe Reaction,ACTEMRA,2/2/2017,Tucson,Arizona,Male,Other Serious,TOCILIZUMAB,Influenza,Influenza,45.752,1,998830210,70
45 to 54 Yrs,ADULT,INFUSION,MG,No Severe Reaction,ACTEMRA,2/2/2017,Tucson,Arizona,Male,Other Serious,TOCILIZUMAB,Musculoskeletal stiffness,Musculoskeletal stiffness,45.752,1,998830210,70